You are not logged in.

This website is a static copy. You cannot log in or post messages.

User Discussion

Compiling Error In OpenSuse 42.2

2nd of February, 2017 03:03

[tsc-users] Compiling Error In OpenSuse 42.2

Seems I am missing a library somewhere. I do have installed libcegui-0 0.8.7-1.32 libcegui-devel 0.8.7-1.32 Any ideas what I am missing? In file from /usr/include/OGRE/OgreSceneManagerEnumerator.h:33:0, from /usr/include/OGRE/OgreRoot.h:36, from /usr/include/OGRE/Ogre.h:94, from CEGUIOgreImageCodec.cpp:30: /usr/include/OGRE/OgreSceneManager.h: At global scope: /usr/include/OGRE/OgreSceneManager.h:747:14: error: field 'mNullShadowTexture' has incomplete type TexturePtr mNullShadowTexture; ^ Makefile:457: recipe for target 'libCEGUIOgreRenderer_la-CEGUIOgreImageCodec.lo' failed make[7]: *** [libCEGUIOgreRenderer_la-CEGUIOgreImageCodec.lo] Error 1 Makefile:358: recipe for target 'all-recursive' failed make[6]: *** [all-recursive] Error 1 Makefile:2440: recipe for target 'all-recursive' failed make[5]: *** [all-recursive] Error 1 Makefile:419: recipe for target 'all-recursive' failed make[4]: *** [all-recursive] Error 1 Makefile:376: recipe for target 'all-recursive' failed make[3]: *** [all-recursive] Error 1 CMakeFiles/cegui07.dir/build.make:113: recipe for target 'cegui/src/cegui07-stamp/cegui07-build' failed make[2]: *** [cegui/src/cegui07-stamp/cegui07-build] Error 2 CMakeFiles/Makefile2:104: recipe for target 'CMakeFiles/cegui07.dir/all' failed make[1]: *** [CMakeFiles/cegui07.dir/all] Error 2 Makefile:149: recipe for target 'all' failed make: *** [all] Error 2